{"text_format":"1","workbook":"xlsx","n_sheets":4,"sheets":["How to use the Assessment tool","Triage and Reg  MOC questions","Summary report ","Lists"],"not_rendered":{"charts":0,"images":3,"macros":0,"external_links":0,"defined_names":2,"comments":0,"pivot_tables":0},"unopened":[],"bounds":{"document_bytes":16777216,"sheet_cells":100000,"rows_first":2000,"rows_last":500,"rows_between":2000,"halvings":0,"cell_chars":16384,"cell_head_chars":4096},"cells_cut":0,"cells_raw":0,"read":"whole","date_system":"1900"}

{"sheet":"How to use the Assessment tool","index":0,"n_rows":4,"n_cols":1,"rows_kept":4,"cut":false,"hidden":false,"merged":[]}
[]
["Emergency Models of Care - Self Assessment Tool"]
["Purpose: \nThe following assessment tool is designed to assess the effectiveness of current emergency care models in place in your ED. The tool assesses four domains related to the model: \n1. Implementation considerations; \n2. Staffing levels, training and competencies; \n3. Guidelines, policies and clinical pathways to support operation of the model; and \n4. Monitoring measures to enable ongoing assessment and quality improvement. \nEach of the four domains has a selection of questions based on the principles of the emergency care model, and the essential elements to facilitate/influence their effective operation and delivery of timely and quality care for patients. \nBy completing the self assessment and assessing the models in your ED, you will have a clearer picture of where the model works well, and you can identify priority areas to improve operation of the model to assist with improving patient flow.\nInstructions:\nThe Self Assessment Tool is complementary to the Models of Care document and should be used in conjunction with that document. \nWho completes the Self Assessment? \nThe Self Assessment is intended to be completed by a nominated Emergency Department Project Officer / staff member in consultation with the relevant staff within the ED. It is suggested that included are: ED Director, Nursing Unit Manager, senior medical and nursing staff.\nWhat do you need to prepare to complete the Self Assessment?\nBefore completing the self assessment it is important to:\n• Review the tool to understand the data/information required to enable you to answer the questions effectively. \n• Hold a meeting with the key staff in ED to discuss and agree the current processes and what occurs when the model is operating, identify the sources of data for each question, and to agree a process of review of summarised responses and associated actions.\n• Gather performance data, procedures, clinical pathways and any other information to support review of the model.\n"]
["Step by step guide to completing the self assessment:\nStep 1: Click on the ‘Fast track MOC questions’ tab. \nThe tool provides a series of questions to be answered. It is essential to answer the questions honestly as each answer is linked to a specific action that should be undertaken to improve the effectiveness of your ED Model of Care.\nStep 2: Respond to each question by clicking the drop down list in the rating column at the end of the question. There are four possible answers to each question - these are ratings A, B, C and D. \nExamples of a question about processes and possible answers are:\nQ: Are these processes applied at all times as per the guideline?\nA - The ED has a documented process that is in place and followed.\nB - The ED has a documented process in place that is followed some of the time.\nC - The ED does not have well documented or well defined processes. OR The processes are in place but are not always followed.\nD - The ED has no standardised or well defined processes in place.\nChoose the answer that best reflects what's happening in your ED.\nStep 3: Once you have answered all questions click on the ‘Summary Report tab’. This tab will provide you with summarised answers to the questions with a set of actions to assist you to make necessary improvements. \n\nWhat do you do with the information once you have completed the Self Assessment?\nOnce you have completed the Self Assessment and generated the summary report, it is important to meet again with the key staff in ED to validate responses and formulate an action plan. \nThe summary report provides actions against each question and is designed to be used by your ED to formulate an action plan. The action plan will include the actions be outlined in the Summary Report and you may include additional actions pertinent to your ED. The action plan should include all with clear guidance for required tasks, assigned owners of the tasks and defined timelines for completion.\nIn addressing the areas for improvement in your ED model of care, it is essential to refer back to the Models of Care document to assist your ED to understand what it is you are aiming to achieve in relation to the key principles, features and monitoring measures for each model.\n"]

{"sheet":"Triage and Reg  MOC questions","index":1,"n_rows":25,"n_cols":3,"rows_kept":25,"cut":false,"hidden":false,"merged":[[0,0,0,2]]}
["Triage & Registration"]
[null,"Assessment domains","Rating"]
[null,"Implementation of the Model"]
[1,"Is Triage collocated with registration at the front of ED to allow for efficient processing of patients?","A - The ED has dedicated spaces/resources as included in the guidelines and principles to allow the model to operate at all times."]
[2,"Is there a process in enable registration at the bedside if not completed when patient is triaged?","B - The ED has dedicated spaces/resources to allow the model to operate some of the time.  "]
[3,"Is there clear and prominent signage directing people to triage and registration?","C - The triage area is immediately accessible and with signage posted. The signage is not according to NSW Health and ACEM recommendations and patients and carers frequently experience difficulty locating triage on arrival in ED. "]
[4,"Has the ED reviewed activity data, including modes of presentation, to understand the peak periods of demand and to inform a flexible approach and level of staffing required at triage?","C - The ED has reviewed some activity data/patient cohorts/available resources to support the implementation of the model. "]
[null,"Staff Competencies"]
[5,"Is there is a competency framework in place and applied for all staff who work at triage,  for example use of the Emergency Training Education Kit (ETEK), and a formalised mentoring program for staff new to the role of triage?","A - All staff working in this area have completed a package that is accredited and recognised by ACEM/emergency care professional bodies."]
[6,"What proportion of staff rostered in the role of triage have successfully completed the ETEK (or similar accredited program) and been mentored in their role? ","A - All staff have been trained and accredited in this area."]
[7,"Does your ED roster a second triage trained staff member for those shifts known to require the flexible triage model to meet peaks in demand? ","D - No staff have been trained or accredited in this area."]
[null,"Guidelines"]
[8,"Is triage time limited to less than 5 mins for 90% of triage episodes?","A - The ED has well established monitoring processes in place and is meeting all targets."]
[9,"Are there guidelines in place to direct the care/interventions that should be carried out at triage?","C - The ED does not have well documented or well defined guidelines in our ED. The guidelines are in place but are not always followed.   "]
[10,"Is there a process in place to monitor the triage process and waiting times?","D - The ED does not have standardised monitoring processes in place. "]
{"$rows_left_out":11}
{"sheet":"Summary report ","index":2,"n_rows":25,"n_cols":4,"rows_kept":25,"cut":false,"hidden":false,"merged":[[0,0,0,3]]}
["Triage & Registration - Summary "]
["#","Questions ","Answers to questions","Action required"]
[null,"Implementation of the model "]
[1,"Is Triage collocated with registration at the front of ED to allow for efficient processing of patients?",{"$f":"'Triage and Reg  MOC questions'!C4","v":"A - The ED has dedicated spaces/resources as included in the guidelines and principles to allow the model to operate at all times."},{"$f":"VLOOKUP($C4,Lists!$B$2:$C$500,2,FALSE)","v":"Continue to evaluate demand pressures on the ED and model of care by determining the volume of patients that are seen in the model and evaluate if the physical space and resources are sufficient.\nEvaluate the performance of the model to determine efficiency. This should be undertaken by assessing performance data and conducting satisfaction surveys of staff and patients. Use this data to inform/identify any requisite changes to improve the physical layout of the model or include additional resources to improve the efficiency of the model.\n"}]
[2,"Is there a process in enable registration at the bedside if not completed when patient is triaged?",{"$f":"'Triage and Reg  MOC questions'!C5","v":"B - The ED has dedicated spaces/resources to allow the model to operate some of the time.  "},{"$f":"VLOOKUP($C5,Lists!$B$2:$C$500,2,FALSE)","v":"Evaluate the performance data of the model to determine if the physical space and resources are adequate to run the model efficiently. This should be undertaken by assessing performance data and conducting satisfaction surveys of staff and patients. This has the potential to improve the physical layout of the model or include additional resources to improve the efficiency of the model.\n\nNeed to determine why the model is not operating continuously, is there a lack of:\na) Physical space to operate the model continuously - Undertake a staffing survey to determine if the current physical space has any impact on the function of the model. Questions should investigate: ease of access to the model, is the area large enough to cater for volume of patients, is the physical space adequate to assess the current volume of patients. \nb) Demand for the model to operate the model continuously -  you will need to evaluate the demand requirements for the model. This involves correlating the volume of patients and the time of day to determine peak periods of demand. If the demand does not support the model to run continuously, align the models operating times with peak demand periods.\nc) Staffing resources to operate the model continuously -  is there a sufficient amount of staff to run the model continuously, if yes, determine if a) or b) is the cause of the model not running continuously. If there is not enough staff, evaluate rostering schedules to reorganise staff to make them available to work in the model continuously. If there is an insufficient skill mix of staff to run the model consider retraining or up skilling staff to work in the model. You can refer to the ED-WAT to understand alternative staffing options.      "}]
[3,"Is there clear and prominent signage directing people to triage and registration?",{"$f":"'Triage and Reg  MOC questions'!C6","v":"C - The triage area is immediately accessible and with signage posted. The signage is not according to NSW Health and ACEM recommendations and patients and carers frequently experience difficulty locating triage on arrival in ED. "},{"$f":"VLOOKUP($C6,Lists!$B$2:$C$500,2,FALSE)","v":"Refer to the  NSW Health PD2010_075 Emergency Department Patients Awaiting Care and GL2009_010 Technical Series 2 - Wayfinding for Health Facilities for guidance on appropriate signage for your ED. Review the gaps in signage recommended and modify as required.  \nPut in place measures to monitor the effectiveness of signage for triage. Include data from satisfaction surveys of staff and patients, and any adverse events/complaints  to assess the effectiveness of signage. \nPrevent the posting of distracting or misleading signage in the waiting room. \nReview recommended signage using the Practical steps to improving Emergency Department signage guide.\nhttp://internal.health.nsw.gov.au/pubs/2008/ed_signage.html. "}]
[4,"Has the ED reviewed activity data, including modes of presentation, to understand the peak periods of demand and to inform a flexible approach and level of staffing required at triage?",{"$f":"'Triage and Reg  MOC questions'!C7","v":"C - The ED has reviewed some activity data/patient cohorts/available resources to support the implementation of the model. "},{"$f":"VLOOKUP($C7,Lists!$B$2:$C$500,2,FALSE)","v":"Determine what activity data/patient cohorts/available resources have not been reviewed and determine why the data has not been reviewed. Nominate staff member(s) that will take responsibility of reviewing the data.  \nEstablish regular data review periods and compare activity data against KPIs and available resources - Compare patient cohorts against current clinical pathways and determine if there is a need to expand or update clinical pathways.\nThe reviews should be used to assess the models performance and potential need to change - expand and refine the model. \nFacilitate an ongoing review process of activity data/patient cohorts/available resources:\n- regular (biannually or as changes in performance are seen).\n- revealed to staff to foster a culture of transparency and to promote inclusion of all the staff in the management of the model.\n- used to improve how the model functions.\n- used to compare KPI data and available resources.\n- used to influence clinical pathway development.\nEstablish guidelines to use the reviews to improve the model by linking in with the above activities.    \n   "}]
[null,"Staff Competencies"]
[5,"Is there is a competency framework in place and applied for all staff who work at triage,  for example use of the Emergency Training Education Kit (ETEK), and a formalised mentoring program for staff new to the role of triage?",{"$f":"'Triage and Reg  MOC questions'!C9","v":"A - All staff working in this area have completed a package that is accredited and recognised by ACEM/emergency care professional bodies."},{"$f":"VLOOKUP($C9,Lists!$B$2:$C$500,2,FALSE)","v":"Continue to provide ongoing training programs to existing and new ED staff.\nEvaluate the training programs regularly for effectiveness. \nPut in place feedback processes that allow for continuous improvement of programs. \nCollaborate with ED colleagues and periodically review any training programs that have been introduced/revised for their potential to be used to support education of staff in your ED."}]
[6,"What proportion of staff rostered in the role of triage have successfully completed the ETEK (or similar accredited program) and been mentored in their role? ",{"$f":"'Triage and Reg  MOC questions'!C10","v":"A - All staff have been trained and accredited in this area."},{"$f":"VLOOKUP($C10,Lists!$B$2:$C$500,2,FALSE)","v":"Continue to provide ongoing training to existing and new ED staff. \nRegularly monitor the staff who have been trained in this area and put in place feedback processes that allow for continuous improvement of training programs and their frequency. \nPut in place measures that allow staff to feedback the effectiveness of the program.\n"}]
[7,"Does your ED roster a second triage trained staff member for those shifts known to require the flexible triage model to meet peaks in demand? ",{"$f":"'Triage and Reg  MOC questions'!C11","v":"D - No staff have been trained or accredited in this area."},{"$f":"VLOOKUP($C11,Lists!$B$2:$C$500,2,FALSE)","v":"Analyse the needs of staff in your ED to understand the training requirements. \nDevelop and implement an education program to increase the number of staff trained and accredited in this area. This could be achieved by contacting other EDs to source current programs that are in place. Collaborate with Professional Colleges, Nursing, Medical and other educators to source training programs and to support the implementation and completion of training staff appropriately. Examples of these programs include the NSW Health Transition to Emergency Nursing Program,  and the Emergency Triage Education Kit (ETEK).  \nOnce your program is in place:\nRegularly evaluate the training program for effectiveness.\nPut in place measures that allow staff to feedback the effectiveness of the program."}]
[null,"Guidelines"]
[8,"Is triage time limited to less than 5 mins for 90% of triage episodes?",{"$f":"'Triage and Reg  MOC questions'!C13","v":"A - The ED has well established monitoring processes in place and is meeting all targets."},{"$f":"VLOOKUP($C13,Lists!$B$2:$C$500,2,FALSE)","v":"Continue to monitor the processes and performance of the model using the measures included. \nUndertake an evaluation of the monitoring process to determine:\n- how often the monitoring processes are reviewed, it should be at least every quarter.\n- if results of the monitoring process are fed back to staff to disseminate performance data. Regular feedback loops should be established to disseminate this information. \n- if current process of the model need to be changed to improve the functioning of the model. The efficiency of the model should be continuously reviewed so improvements can be implemented before performance begins to fall"}]
[9,"Are there guidelines in place to direct the care/interventions that should be carried out at triage?",{"$f":"'Triage and Reg  MOC questions'!C14","v":"C - The ED does not have well documented or well defined guidelines in our ED. The guidelines are in place but are not always followed.   "},{"$f":"VLOOKUP($C14,Lists!$B$2:$C$500,2,FALSE)","v":"Carry out a review/analysis of the current guidelines and relevant processes with feedback from staff to understand why they are not followed consistently.\nIdentify the gaps/issues with the guidelines and what must change to improve their use.\nBased on feedback revise and develop guidelines that can facilitate standardised practice to reduce variation and improve the appropriateness of treatment. \nProvide education and appropriate guidance in the use of the guidelines for all staff.  \nPut in place feedback processes to enable staff to feedback in a timely manner and include the revision and monitoring in ED meetings regularly to allow transparency of the process. \nContinue the monitoring process to check for effectiveness and allow for continuous quality improvement and currency of guidelines. \nGain support from the ED and hospital Executive for implementation and use of the guidelines.  "}]
[10,"Is there a process in place to monitor the triage process and waiting times?",{"$f":"'Triage and Reg  MOC questions'!C15","v":"D - The ED does not have standardised monitoring processes in place. "},{"$f":"VLOOKUP($C15,Lists!$B$2:$C$500,2,FALSE)","v":"Consider the monitoring measures you will need to effectively monitor the model.\n Refer to the model of care document to guide your decision making and to understand the data requirements. \nEstablish monitoring measures to determine the effectiveness of the model. Monitoring measures should be purposeful, clearly defined and easy to interpret. Examples include; \n• Operational indicators: eg patient wait times, LOS, off-stretcher times, NEAT and patient turnaround times.\n• Clinical indicators: relates to patient safety more specifically and measures the ‘clinical management or outcome of care’ of patients, such as time to analgesia, time to antibiotics, morbidity, mortality rates, adverse events, patient satisfaction and complaints.\nOnce data requirements been determined, establish the monitoring measures and nominate staff(s) who will have responsibility for collecting data for review. \nAgree on a timeline for the implementation of monitoring measures.  \nThe monitoring measures should be discussed at meetings on a regular (predetermined) basis. "}]
{"$rows_left_out":11}
{"sheet":"Lists","index":3,"n_rows":116,"n_cols":3,"rows_kept":116,"cut":false,"hidden":false,"merged":[]}
[]
[null,"Rating Criteria","Actions"]
[]
[null,"Staff Competencies - staff trained ","Staff Competencies - staff trained "]
[null,"A - All staff have been trained and accredited in this area.","Continue to provide ongoing training to existing and new ED staff. \nRegularly monitor the staff who have been trained in this area and put in place feedback processes that allow for continuous improvement of training programs and their frequency. \nPut in place measures that allow staff to feedback the effectiveness of the program.\n"]
[null,"B - More than 75% of staff have been trained and accredited in this area.","Analyse the needs of staff requiring training in this area.\nEvaluate the training program for effectiveness.\nContinue to provide ongoing training to existing and new ED staff. \nPut in place monitoring and feedback processes that allow staff to feedback the effectiveness of the program.  \nRegularly monitor the staff who have been trained in this area and put in place feedback processes that allow for continuous improvement of training programs and their frequency. "]
[null,"C - Less than 75% of staff have been trained and accredited in this area.","Analyse the needs of staff in your ED to understand the training requirements. \nPlan and implement an education program to increase the number of staff trained and accredited in this area, review the need for Nursing, Medical and other educators to support the enhanced training efforts.\nRegularly evaluate the training program for effectiveness.\nPut in place measures that allow staff to feedback the effectiveness of the program."]
[null,"D - No staff have been trained or accredited in this area.","Analyse the needs of staff in your ED to understand the training requirements. \nDevelop and implement an education program to increase the number of staff trained and accredited in this area. This could be achieved by contacting other EDs to source current programs that are in place. Collaborate with Professional Colleges, Nursing, Medical and other educators to source training programs and to support the implementation and completion of training staff appropriately. Examples of these programs include the NSW Health Transition to Emergency Nursing Program,  and the Emergency Triage Education Kit (ETEK).  \nOnce your program is in place:\nRegularly evaluate the training program for effectiveness.\nPut in place measures that allow staff to feedback the effectiveness of the program."]
[]
[null,"Staff Competencies - education programs","Staff Competencies - education programs "]
[null,"A - All staff working in this area have completed a package that is accredited and recognised by ACEM/emergency care professional bodies.","Continue to provide ongoing training programs to existing and new ED staff.\nEvaluate the training programs regularly for effectiveness. \nPut in place feedback processes that allow for continuous improvement of programs. \nCollaborate with ED colleagues and periodically review any training programs that have been introduced/revised for their potential to be used to support education of staff in your ED."]
[null,"B - More than 75% of staff are trained and accredited using a package /program that is recognised by ACEM/Emergency care professional bodies.","Analyse the needs of staff in your ED to understand the training requirements. \nEvaluate the training program for effectiveness.\nContinue to provide ongoing training programs to existing and new ED staff. \nPut in place monitoring and feedback processes that allow staff to feedback the effectiveness of the program.  \nRegularly monitor the staff who have been trained in this area and put in place feedback processes that allow for continuous improvement of training programs and their frequency. \nCollaborate with ED colleagues and periodically review any training programs that have been introduced/revised for their potential to be used in your ED."]
[null,"C - The ED uses a locally developed education and training program, there is no associated competency assessment or ongoing review.","Analyse the needs of staff in your ED to understand the training requirements. \nReview the locally developed program against other accredited programs for completeness/appropriateness.\nPlan and implement an education program to increase the number of staff trained and accredited in this area, review the need for Nursing, Medical and other educators to support the enhanced training efforts.\nReview competency assessment framework/criteria in place in other areas/EDs/created by professional bodies and implement a competency assessment framework in your ED.  \nCollaborate with ED colleagues and periodically review any training programs that have been introduced/revised for their potential to be used in your ED.\nRegularly monitor the staff who are trained using the new program and put in place monitoring and feedback processes to allow for continuous improvement of training programs."]
[null,"D - The ED does not use any training and competency program in our ED.","Analyse the needs of staff in your ED to understand the training requirements.  \nDevelop and implement an education program to increase the number of staff trained and accredited in this area, collaborate with Professional Colleges, Nursing, Medical and other educators to source training programs and to support the implementation and completion of training staff appropriately.\nReview competency assessment framework/criteria in place in other areas/EDs/created by professional bodies and implement a competency assessment framework in your ED.  \nCollaborate with ED colleagues and periodically review any training programs that have been introduced/revised for their potential to be used in your ED.\nRegularly monitor the staff who are trained using the new program and put in place monitoring and feedback processes to allow for continuous improvement of training programs."]
[]
{"$rows_left_out":101}